ORGANISATION IDENTIFIER (CODE OF PROVIDER),PRIMARY DIAGNOSIS,ADJUNCTIVE THERAPY,INTENT OF TREATMENT,REGIMEN,CLINICAL TRIAL,DRUG NAME,ACTUAL DOSE PER ADMINISTRATION,ADMINISTRATION MEASUREMENT PER ACTUAL DOSE,ADMINISTRATION DATE,ADMINISTRATION MONTH,ADMINISTRATION YEAR,ORGANISATION IDENTIFIER OF SACT ADMINISTRATION
RD8,C900,3,1,Ixazomib Lenalidomide Dexamethasone=,2,LENALIDOMIDE,20,1,26/10/2021,Oct,2021,RD8
RD8,C900,3,1,Ixazomib Lenalidomide Dexamethasone=,2,DEXAMETHASONE,40,1,26/10/2021,Oct,2021,RD8
RD8,C900,3,1,Ixazomib Lenalidomide Dexamethasone=,2,FLUCONAZOLE,50,1,26/10/2021,Oct,2021,RD8
RD8,C900,3,1,Ixazomib Lenalidomide Dexamethasone=,2,Proton pump inhibitor,1,99,26/10/2021,Oct,2021,RD8
RD8,C900,3,1,Ixazomib Lenalidomide Dexamethasone=,2,ACICLOVIR,200,1,26/10/2021,Oct,2021,RD8
RD8,C900,3,1,Zoledronic acid 4 weekly (support)=,2,ZOLEDRONIC ACID,3.3,1,26/10/2021,Oct,2021,RD8
RD8,C900,3,1,Zoledronic acid 4 weekly (support)=,2,CALCICHEW-D3 FORTE,2,99,26/10/2021,Oct,2021,RD8
RD8,C509,,,Aprepitant without dexamethasone (day 1 on ward)=,2,APREPITANT,125,1,25/10/2021,Oct,2021,RD8
RD8,C509,2,2,EC Docetaxel Phesgo SC (neoadjuvant node negative / unknown)=,2,ONDANSETRON,8,1,25/10/2021,Oct,2021,RD8
RD8,C509,2,2,EC Docetaxel Phesgo SC (neoadjuvant node negative / unknown)=,2,DEXAMETHASONE,12,1,25/10/2021,Oct,2021,RD8
RD8,C509,2,2,EC Docetaxel Phesgo SC (neoadjuvant node negative / unknown)=,2,EPIRUBICIN HYDROCHLORIDE,160,1,25/10/2021,Oct,2021,RD8
RD8,C509,2,2,EC Docetaxel Phesgo SC (neoadjuvant node negative / unknown)=,2,CYCLOPHOSPHAMIDE,800,1,25/10/2021,Oct,2021,RD8
RD8,C509,2,2,EC Docetaxel Phesgo SC (neoadjuvant node negative / unknown)=,2,DEXAMETHASONE,6,1,25/10/2021,Oct,2021,RD8
RD8,C509,2,2,EC Docetaxel Phesgo SC (neoadjuvant node negative / unknown)=,2,METOCLOPRAMIDE,10,1,25/10/2021,Oct,2021,RD8
RD8,C509,,,GCSF filgrastim 7 days=,2,FILGRASTIM,30,98,25/10/2021,Oct,2021,RD8
RD8,C900,9,1,Apixaban=,2,APIXABAN,2.5,1,12/10/2021,Oct,2021,RD8
RD8,C900,9,1,Ixazomib Lenalidomide Dexamethasone=,2,FLUCONAZOLE,50,1,12/10/2021,Oct,2021,RD8
RD8,C900,9,1,Ixazomib Lenalidomide Dexamethasone=,2,LENALIDOMIDE,10,1,12/10/2021,Oct,2021,RD8
RD8,C900,9,1,Ixazomib Lenalidomide Dexamethasone=,2,IXAZOMIB,2.3,1,12/10/2021,Oct,2021,RD8
RD8,C900,9,1,Ixazomib Lenalidomide Dexamethasone=,2,DEXAMETHASONE,10,1,12/10/2021,Oct,2021,RD8
RD8,C900,9,1,Ixazomib Lenalidomide Dexamethasone=,2,Proton pump inhibitor,1,99,12/10/2021,Oct,2021,RD8
RD8,C900,9,1,Ixazomib Lenalidomide Dexamethasone=,2,ACICLOVIR,200,1,12/10/2021,Oct,2021,RD8
RD8,C900,,,Lansoprazole=,2,LANSOPRAZOLE,30,1,12/10/2021,Oct,2021,RD8
RD8,C900,9,1,Zoledronic acid 4 weekly (support)=,2,ZOLEDRONIC ACID,4,1,12/10/2021,Oct,2021,RD8
RD8,C900,9,1,Zoledronic acid 4 weekly (support)=,2,CALCICHEW-D3 FORTE,2,99,12/10/2021,Oct,2021,RD8
RD8,C900,,,Zoledronic acid 4 weekly (support)=,2,ZOLEDRONIC ACID,4,1,26/10/2021,Oct,2021,RD8
RD8,C155,9,3,Trastuzumab Cisplatin Capecitabine (GOJ)=,2,TRASTUZUMAB,441,1,01/10/2021,Oct,2021,RD8
RD8,C155,9,3,Trastuzumab Cisplatin Capecitabine (GOJ)=,2,SODIUM CHLORIDE,500,98,22/10/2021,Oct,2021,RD8
RD8,C155,9,3,Trastuzumab Cisplatin Capecitabine (GOJ)=,2,TRASTUZUMAB,441,1,22/10/2021,Oct,2021,RD8
RD8,C900,9,4,Apixaban=,2,APIXABAN,2.5,1,12/10/2021,Oct,2021,RD8
RD8,C900,9,4,Carfilzomib Lenalidomide Dexamethasone (CarLenDex)=,2,Proton pump inhibitor,1,99,12/10/2021,Oct,2021,RD8
RD8,C900,9,4,Carfilzomib Lenalidomide Dexamethasone (CarLenDex)=,2,SODIUM CHLORIDE,500,98,12/10/2021,Oct,2021,RD8
RD8,C900,9,4,Carfilzomib Lenalidomide Dexamethasone (CarLenDex)=,2,CARFILZOMIB,60,1,12/10/2021,Oct,2021,RD8
RD8,C900,9,4,Carfilzomib Lenalidomide Dexamethasone (CarLenDex)=,2,DEXAMETHASONE,20,1,12/10/2021,Oct,2021,RD8
RD8,C900,9,4,Carfilzomib Lenalidomide Dexamethasone (CarLenDex)=,2,LENALIDOMIDE,25,1,12/10/2021,Oct,2021,RD8
RD8,C900,9,4,Carfilzomib Lenalidomide Dexamethasone (CarLenDex)=,2,ACICLOVIR,200,1,12/10/2021,Oct,2021,RD8
RD8,C900,9,4,Carfilzomib Lenalidomide Dexamethasone (CarLenDex)=,2,FLUCONAZOLE,50,1,12/10/2021,Oct,2021,RD8
RD8,C900,9,4,Carfilzomib Lenalidomide Dexamethasone (CarLenDex)=,2,SODIUM CHLORIDE,500,98,13/10/2021,Oct,2021,RD8
RD8,C900,9,4,Carfilzomib Lenalidomide Dexamethasone (CarLenDex)=,2,CARFILZOMIB,60,1,13/10/2021,Oct,2021,RD8
RD8,C900,9,4,Carfilzomib Lenalidomide Dexamethasone (CarLenDex)=,2,SODIUM CHLORIDE,500,98,19/10/2021,Oct,2021,RD8
RD8,C900,9,4,Carfilzomib Lenalidomide Dexamethasone (CarLenDex)=,2,CARFILZOMIB,60,1,19/10/2021,Oct,2021,RD8
RD8,C900,9,4,Carfilzomib Lenalidomide Dexamethasone (CarLenDex)=,2,SODIUM CHLORIDE,500,98,20/10/2021,Oct,2021,RD8
RD8,C900,9,4,Carfilzomib Lenalidomide Dexamethasone (CarLenDex)=,2,CARFILZOMIB,60,1,20/10/2021,Oct,2021,RD8
RD8,C900,9,4,Carfilzomib Lenalidomide Dexamethasone (CarLenDex)=,2,SODIUM CHLORIDE,500,98,26/10/2021,Oct,2021,RD8
RD8,C900,9,4,Carfilzomib Lenalidomide Dexamethasone (CarLenDex)=,2,CARFILZOMIB,60,1,26/10/2021,Oct,2021,RD8
RD8,C900,9,4,Carfilzomib Lenalidomide Dexamethasone (CarLenDex)=,2,SODIUM CHLORIDE,500,98,27/10/2021,Oct,2021,RD8
RD8,C900,9,4,Carfilzomib Lenalidomide Dexamethasone (CarLenDex)=,2,CARFILZOMIB,60,1,27/10/2021,Oct,2021,RD8
RD8,C900,,,Nystatin=,2,NYSTATIN,1,98,11/10/2021,Oct,2021,RD8
RD8,C900,,,Zoledronic acid 4 weekly (support)=,2,ZOLEDRONIC ACID,4,1,28/10/2021,Oct,2021,RD8
RD8,C911,,5,Aciclovir prophylaxis 200mg tds=,1,ACICLOVIR,200,1,19/10/2021,Oct,2021,RD8
RD8,C911,,5,FLAIR Ibrutinib Venetoclax (NCRN Trial)=,1,Ibrutinib,420,1,19/10/2021,Oct,2021,RD8
RD8,C911,,5,FLAIR Ibrutinib Venetoclax (NCRN Trial)=,1,Venetoclax,200,1,19/10/2021,Oct,2021,RD8
RD8,C911,,5,FLAIR Ibrutinib Venetoclax (NCRN Trial)=,1,CO-TRIMOXAZOLE,480,1,19/10/2021,Oct,2021,RD8
RD8,C719,1,2,Ondansetron temozolomide 5 day=,2,ONDANSETRON,8,1,04/10/2021,Oct,2021,RD8
RD8,C719,1,2,Temozolomide 150/200 (astrocytoma)=,2,TEMOZOLOMIDE,360,1,04/10/2021,Oct,2021,RD8
RD8,C349,9,3,Topotecan (oral)=,2,TOPOTECAN,2.75,1,05/10/2021,Oct,2021,RD8
RD8,C911,,5,FLAIR Ibrutinib monotherapy (NCRN Trial)=,1,Ibrutinib,420,1,05/10/2021,Oct,2021,RD8
RD8,C911,3,2,Obinutuzumab Venetoclax=,2,DEXAMETHASONE,20,1,27/10/2021,Oct,2021,RD8
RD8,C911,3,2,Obinutuzumab Venetoclax=,2,CHLORPHENAMINE,10,1,27/10/2021,Oct,2021,RD8
RD8,C911,3,2,Obinutuzumab Venetoclax=,2,PARACETAMOL,1000,1,27/10/2021,Oct,2021,RD8
RD8,C911,3,2,Obinutuzumab Venetoclax=,2,OBINUTUZUMAB,1000,1,27/10/2021,Oct,2021,RD8
RD8,C911,3,2,Obinutuzumab Venetoclax=,2,VENETOCLAX,400,1,27/10/2021,Oct,2021,RD8
RD8,C911,3,2,Obinutuzumab Venetoclax=,2,ACICLOVIR,200,1,27/10/2021,Oct,2021,RD8
RD8,C187,9,2,Calcium folinate 350mg=,2,CALCIUM FOLINATE,350,1,04/10/2021,Oct,2021,RD8
RD8,C187,9,2,Cetuximab Oxaliplatin Modified DeGramont=,2,CHLORPHENAMINE,10,1,04/10/2021,Oct,2021,RD8
RD8,C187,9,2,Cetuximab Oxaliplatin Modified DeGramont=,2,CETUXIMAB,800,1,04/10/2021,Oct,2021,RD8
RD8,C187,9,2,Cetuximab Oxaliplatin Modified DeGramont=,2,FLUOROURACIL,550,1,04/10/2021,Oct,2021,RD8
RD8,C187,9,2,Cetuximab Oxaliplatin Modified DeGramont=,2,FLUOROURACIL,3500,1,04/10/2021,Oct,2021,RD8
RD8,C187,9,2,Loperamide=,2,LOPERAMIDE,2,1,04/10/2021,Oct,2021,RD8
RD8,C187,9,2,Moderate emetic risk ondansetron 1.5 days=,2,ONDANSETRON,8,1,04/10/2021,Oct,2021,RD8
RD8,C187,9,2,Moderate emetic risk ondansetron 1.5 days=,2,DEXAMETHASONE,8,1,04/10/2021,Oct,2021,RD8
RD8,C187,9,2,Moderate emetic risk ondansetron 1.5 days=,2,METOCLOPRAMIDE,10,1,04/10/2021,Oct,2021,RD8
RD8,C852,,,Apixaban=,2,APIXABAN,5,1,14/10/2021,Oct,2021,RD8
RD8,C852,,,Ondansetron metoclopramide 5 days=,2,ONDANSETRON,8,1,14/10/2021,Oct,2021,RD8
RD8,C852,9,1,Rituximab Gemcitabine Dexamethasone Cisplatin (R-GDP) (daypatient)=,2,PARACETAMOL,1000,1,14/10/2021,Oct,2021,RD8
RD8,C852,9,1,Rituximab Gemcitabine Dexamethasone Cisplatin (R-GDP) (daypatient)=,2,CHLORPHENAMINE,10,1,14/10/2021,Oct,2021,RD8
RD8,C852,9,1,Rituximab Gemcitabine Dexamethasone Cisplatin (R-GDP) (daypatient)=,2,HYDROCORTISONE (AS SODIUM SUCCINATE,100,1,14/10/2021,Oct,2021,RD8
RD8,C852,9,1,Rituximab Gemcitabine Dexamethasone Cisplatin (R-GDP) (daypatient)=,2,RITUXIMAB,600,1,14/10/2021,Oct,2021,RD8
RD8,C852,9,1,Rituximab Gemcitabine Dexamethasone Cisplatin (R-GDP) (daypatient)=,2,DEXAMETHASONE,40,1,14/10/2021,Oct,2021,RD8
RD8,C852,9,1,Rituximab Gemcitabine Dexamethasone Cisplatin (R-GDP) (daypatient)=,2,ALLOPURINOL,300,1,14/10/2021,Oct,2021,RD8
RD8,C852,9,1,Rituximab Gemcitabine Dexamethasone Cisplatin (R-GDP) (daypatient)=,2,ACICLOVIR,200,1,14/10/2021,Oct,2021,RD8
RD8,C852,9,1,Rituximab Gemcitabine Dexamethasone Cisplatin (R-GDP) (daypatient)=,2,FLUCONAZOLE,50,1,14/10/2021,Oct,2021,RD8
RD8,C852,9,1,Rituximab Gemcitabine Dexamethasone Cisplatin (R-GDP) (daypatient)=,2,GEMCITABINE,1500,1,15/10/2021,Oct,2021,RD8
RD8,C852,9,1,Rituximab Gemcitabine Dexamethasone Cisplatin (R-GDP) (daypatient)=,2,MAGNESIUM SULPHATE,8,98,15/10/2021,Oct,2021,RD8
RD8,C852,9,1,Rituximab Gemcitabine Dexamethasone Cisplatin (R-GDP) (daypatient)=,2,Mannitol 10%,200,98,15/10/2021,Oct,2021,RD8
RD8,C852,9,1,Rituximab Gemcitabine Dexamethasone Cisplatin (R-GDP) (daypatient)=,2,CISPLATIN,113,1,15/10/2021,Oct,2021,RD8
RD8,C852,9,1,Rituximab Gemcitabine Dexamethasone Cisplatin (R-GDP) (daypatient)=,2,FUROSEMIDE,40,1,15/10/2021,Oct,2021,RD8
RD8,C852,9,1,Rituximab Gemcitabine Dexamethasone Cisplatin (R-GDP) (daypatient)=,2,GEMCITABINE,1500,1,22/10/2021,Oct,2021,RD8
RD8,C349,,2,Ceritinib=,2,LOPERAMIDE,2,1,11/10/2021,Oct,2021,RD8
RD8,C349,,2,Ceritinib=,2,CERITINIB,300,1,11/10/2021,Oct,2021,RD8
RD8,C155,,,Calcium folinate 350mg=,2,CALCIUM FOLINATE,350,1,26/10/2021,Oct,2021,RD8
RD8,C155,2,1,Docetaxel Fluorouracil Oxaliplatin (FLOT)=,2,ONDANSETRON,8,1,26/10/2021,Oct,2021,RD8
RD8,C155,2,1,Docetaxel Fluorouracil Oxaliplatin (FLOT)=,2,DOCETAXEL,80,1,26/10/2021,Oct,2021,RD8
RD8,C155,2,1,Docetaxel Fluorouracil Oxaliplatin (FLOT)=,2,OXALIPLATIN,135,1,26/10/2021,Oct,2021,RD8
RD8,C155,2,1,Docetaxel Fluorouracil Oxaliplatin (FLOT)=,2,FLUOROURACIL,3950,1,26/10/2021,Oct,2021,RD8
RD8,C155,2,1,Docetaxel Fluorouracil Oxaliplatin (FLOT)=,2,METOCLOPRAMIDE,10,1,26/10/2021,Oct,2021,RD8
RD8,C155,2,1,Mouth and Bowel Support Minus Metoclopramide=,2,LOPERAMIDE,2,1,26/10/2021,Oct,2021,RD8
RD8,C155,2,1,Mouth and Bowel Support Minus Metoclopramide=,2,DIFFLAM,15,98,26/10/2021,Oct,2021,RD8
RD8,C56X,2,1,Bevacizumab (7.5mg/kg) Paclitaxel Carboplatin (CrCl) (ovarian)=,2,SODIUM CHLORIDE,500,98,12/10/2021,Oct,2021,RD8
RD8,C56X,2,1,Bevacizumab (7.5mg/kg) Paclitaxel Carboplatin (CrCl) (ovarian)=,2,BEVACIZUMAB,600,1,12/10/2021,Oct,2021,RD8
RD8,C56X,2,1,Bevacizumab (7.5mg/kg) Paclitaxel Carboplatin (CrCl) (ovarian)=,2,DEXAMETHASONE,20,1,12/10/2021,Oct,2021,RD8
RD8,C56X,2,1,Bevacizumab (7.5mg/kg) Paclitaxel Carboplatin (CrCl) (ovarian)=,2,CHLORPHENAMINE,10,1,12/10/2021,Oct,2021,RD8
RD8,C56X,2,1,Bevacizumab (7.5mg/kg) Paclitaxel Carboplatin (CrCl) (ovarian)=,2,PACLITAXEL,336,1,12/10/2021,Oct,2021,RD8
RD8,C56X,2,1,Bevacizumab (7.5mg/kg) Paclitaxel Carboplatin (CrCl) (ovarian)=,2,CARBOPLATIN,630,1,12/10/2021,Oct,2021,RD8
RD8,C56X,,,Moderate emetic risk ondansetron 3.5 days=,2,ONDANSETRON,8,1,12/10/2021,Oct,2021,RD8
RD8,C56X,,,Moderate emetic risk ondansetron 3.5 days=,2,DEXAMETHASONE,0,1,12/10/2021,Oct,2021,RD8
RD8,C56X,,,Moderate emetic risk ondansetron 3.5 days=,2,DEXAMETHASONE,8,1,12/10/2021,Oct,2021,RD8
RD8,C56X,,,Moderate emetic risk ondansetron 3.5 days=,2,METOCLOPRAMIDE,10,1,12/10/2021,Oct,2021,RD8
RD8,C900,9,4,Apixaban=,2,APIXABAN,2.5,1,07/10/2021,Oct,2021,RD8
RD8,C900,9,4,Colesevelam =,2,COLESEVELAM HYDROCHLORIDE,625,1,07/10/2021,Oct,2021,RD8
RD8,C900,9,4,Isatuximab Pomalidomide Dexamethasone (EAMS)=,2,CHLORPHENAMINE,10,1,07/10/2021,Oct,2021,RD8
RD8,C900,9,4,Isatuximab Pomalidomide Dexamethasone (EAMS)=,2,PARACETAMOL,1000,1,07/10/2021,Oct,2021,RD8
RD8,C900,9,4,Isatuximab Pomalidomide Dexamethasone (EAMS)=,2,DEXAMETHASONE,5,1,07/10/2021,Oct,2021,RD8
RD8,C900,9,4,Isatuximab Pomalidomide Dexamethasone (EAMS)=,2,Isatuximab,700,1,07/10/2021,Oct,2021,RD8
RD8,C900,9,4,Isatuximab Pomalidomide Dexamethasone (EAMS)=,2,Pomalidomide,3,1,07/10/2021,Oct,2021,RD8
RD8,C900,9,4,Isatuximab Pomalidomide Dexamethasone (EAMS)=,2,FLUCONAZOLE,50,1,07/10/2021,Oct,2021,RD8
RD8,C900,9,4,Isatuximab Pomalidomide Dexamethasone (EAMS)=,2,ACICLOVIR,200,1,07/10/2021,Oct,2021,RD8
RD8,C900,9,4,Isatuximab Pomalidomide Dexamethasone (EAMS)=,2,CHLORPHENAMINE,10,1,21/10/2021,Oct,2021,RD8
RD8,C900,9,4,Isatuximab Pomalidomide Dexamethasone (EAMS)=,2,PARACETAMOL,1000,1,21/10/2021,Oct,2021,RD8
RD8,C900,9,4,Isatuximab Pomalidomide Dexamethasone (EAMS)=,2,DEXAMETHASONE,5,1,21/10/2021,Oct,2021,RD8
RD8,C900,9,4,Isatuximab Pomalidomide Dexamethasone (EAMS)=,2,Isatuximab,700,1,21/10/2021,Oct,2021,RD8
RD8,C900,9,4,Lansoprazole=,2,LANSOPRAZOLE,30,1,07/10/2021,Oct,2021,RD8
RD8,C911,,,Liposomal amphotericin B (Ambisome) prophylaxis low dose=,2,AMPHOTERICIN ENCAPSULATED IN LIPOSO,76,1,19/10/2021,Oct,2021,RD8
RD8,C911,,,Liposomal amphotericin B (Ambisome) prophylaxis low dose=,2,AMPHOTERICIN ENCAPSULATED IN LIPOSO,76,1,26/10/2021,Oct,2021,RD8
RD8,C509,,,Aprepitant without dexamethasone (day 1 on ward)=,2,APREPITANT,125,1,19/10/2021,Oct,2021,RD8
RD8,C509,1,1,EC Docetaxel=,2,SODIUM CHLORIDE,500,98,19/10/2021,Oct,2021,RD8
RD8,C509,1,1,EC Docetaxel=,2,ONDANSETRON,8,1,19/10/2021,Oct,2021,RD8
RD8,C509,1,1,EC Docetaxel=,2,DEXAMETHASONE,12,1,19/10/2021,Oct,2021,RD8
RD8,C509,1,1,EC Docetaxel=,2,EPIRUBICIN HYDROCHLORIDE,140,1,19/10/2021,Oct,2021,RD8
RD8,C509,1,1,EC Docetaxel=,2,CYCLOPHOSPHAMIDE,700,1,19/10/2021,Oct,2021,RD8
RD8,C509,1,1,EC Docetaxel=,2,DEXAMETHASONE,6,1,19/10/2021,Oct,2021,RD8
RD8,C509,1,1,EC Docetaxel=,2,METOCLOPRAMIDE,10,1,19/10/2021,Oct,2021,RD8
RD8,C944,9,2,Peginterferon alpha-2a (Pegasys)=,2,PEGINTERFERON ALFA-2A,45,2,28/10/2021,Oct,2021,RD8
RD8,C504,2,1,Aprepitant without dexamethasone (day 1 on ward)=,2,APREPITANT,125,1,04/10/2021,Oct,2021,RD8
RD8,C504,2,1,Aprepitant without dexamethasone (day 1 on ward)=,2,APREPITANT,125,1,25/10/2021,Oct,2021,RD8
RD8,C504,2,1,EC Docetaxel=,2,DOCETAXEL,200,1,04/10/2021,Oct,2021,RD8
RD8,C504,2,1,EC Docetaxel=,2,SODIUM CHLORIDE,500,98,25/10/2021,Oct,2021,RD8
RD8,C504,2,1,EC Docetaxel=,2,DOCETAXEL,164,1,25/10/2021,Oct,2021,RD8
RD8,C504,2,1,EC Docetaxel=,2,DEXAMETHASONE,8,1,25/10/2021,Oct,2021,RD8
RD8,C504,,,Fluconazole prophylaxis 5 days=,2,FLUCONAZOLE,50,1,25/10/2021,Oct,2021,RD8
RD8,C504,2,1,GCSF filgrastim 5 days=,2,FILGRASTIM,48,98,04/10/2021,Oct,2021,RD8
RD8,C504,2,1,GCSF filgrastim 5 days=,2,FILGRASTIM,48,98,25/10/2021,Oct,2021,RD8
RD8,C343,,,Aprepitant without dexamethasone (day 1 on ward)=,2,APREPITANT,125,1,22/10/2021,Oct,2021,RD8
RD8,C343,2,2,Pemetrexed Cisplatin=,2,SODIUM CHLORIDE,500,98,22/10/2021,Oct,2021,RD8
RD8,C343,2,2,Pemetrexed Cisplatin=,2,ONDANSETRON,8,1,22/10/2021,Oct,2021,RD8
RD8,C343,2,2,Pemetrexed Cisplatin=,2,DEXAMETHASONE,0,1,22/10/2021,Oct,2021,RD8
RD8,C343,2,2,Pemetrexed Cisplatin=,2,MAGNESIUM SULPHATE,8,98,22/10/2021,Oct,2021,RD8
RD8,C343,2,2,Pemetrexed Cisplatin=,2,PEMETREXED,900,1,22/10/2021,Oct,2021,RD8
RD8,C343,2,2,Pemetrexed Cisplatin=,2,CISPLATIN,128,1,22/10/2021,Oct,2021,RD8
RD8,C343,2,2,Pemetrexed Cisplatin=,2,FUROSEMIDE,40,1,22/10/2021,Oct,2021,RD8
RD8,C343,2,2,Pemetrexed Cisplatin=,2,DEXAMETHASONE,4,1,22/10/2021,Oct,2021,RD8
RD8,C343,2,2,Pemetrexed Cisplatin=,2,METOCLOPRAMIDE,10,1,22/10/2021,Oct,2021,RD8
RD8,C343,2,2,Pemetrexed Cisplatin=,2,FOLIC ACID,0,2,22/10/2021,Oct,2021,RD8
RD8,C343,2,2,Pemetrexed Cisplatin=,2,HYDROXOCOBALAMIN,0,2,22/10/2021,Oct,2021,RD8
RD8,C170,1,1,Oxaliplatin Capecitabine (CapOx)=,2,GLUCOSE,500,98,28/10/2021,Oct,2021,RD8
RD8,C170,1,1,Oxaliplatin Capecitabine (CapOx)=,2,ONDANSETRON,8,1,28/10/2021,Oct,2021,RD8
RD8,C170,1,1,Oxaliplatin Capecitabine (CapOx)=,2,DEXAMETHASONE,8,1,28/10/2021,Oct,2021,RD8
RD8,C170,1,1,Oxaliplatin Capecitabine (CapOx)=,2,OXALIPLATIN,225,1,28/10/2021,Oct,2021,RD8
RD8,C170,1,1,Oxaliplatin Capecitabine (CapOx)=,2,METOCLOPRAMIDE,10,1,28/10/2021,Oct,2021,RD8
RD8,C170,1,1,Oxaliplatin Capecitabine (CapOx)=,2,CAPECITABINE,1800,1,28/10/2021,Oct,2021,RD8
RD8,C509,,,Denosumab (metastases)=,2,DENOSUMAB,120,1,22/10/2021,Oct,2021,RD8
RD8,C509,,,Denosumab (metastases)=,2,CALCIUM CARBONATE              WITH,1,98,22/10/2021,Oct,2021,RD8
RD8,C155,9,5,Dexamethasone pre/post docetaxel 8mg po 3 day=,2,DEXAMETHASONE,8,1,21/10/2021,Oct,2021,RD8
RD8,C155,9,5,Docetaxel=,2,DOCETAXEL,96,1,25/10/2021,Oct,2021,RD8
RD8,C155,9,5,Docetaxel=,2,METOCLOPRAMIDE,10,1,25/10/2021,Oct,2021,RD8
RD8,C349,,2,Pembrolizumab 200mg then 400mg (relapsed/metastatic)=,2,Pembrolizumab,400,1,05/10/2021,Oct,2021,RD8
RD8,C259,1,1,Gemcitabine Capecitabine=,2,GEMCITABINE,1400,1,06/10/2021,Oct,2021,RD8
RD8,C259,1,1,Gemcitabine Capecitabine=,2,CAPECITABINE,1150,1,06/10/2021,Oct,2021,RD8
RD8,C259,1,1,Gemcitabine Capecitabine=,2,GEMCITABINE,1400,1,13/10/2021,Oct,2021,RD8
RD8,C259,1,1,Gemcitabine Capecitabine=,2,SODIUM CHLORIDE,500,98,20/10/2021,Oct,2021,RD8
RD8,C259,1,1,Gemcitabine Capecitabine=,2,GEMCITABINE,1400,1,20/10/2021,Oct,2021,RD8
RD8,C503,2,1,EC Docetaxel=,2,DOCETAXEL,164,1,13/10/2021,Oct,2021,RD8
RD8,C503,2,1,GCSF filgrastim 5 days=,2,FILGRASTIM,30,98,13/10/2021,Oct,2021,RD8
RD8,C182,1,1,Capecitabine (1250) adjuvant=,2,CAPECITABINE,1500,1,21/10/2021,Oct,2021,RD8
RD8,C182,1,1,Mouth and bowel support=,2,METOCLOPRAMIDE,10,1,21/10/2021,Oct,2021,RD8
RD8,C182,1,1,Mouth and bowel support=,2,LOPERAMIDE,2,1,21/10/2021,Oct,2021,RD8
RD8,C155,,,Mouth and Bowel Support Minus Metoclopramide=,2,LOPERAMIDE,2,1,25/10/2021,Oct,2021,RD8
RD8,C155,,,Mouth and Bowel Support Minus Metoclopramide=,2,DIFFLAM,15,98,25/10/2021,Oct,2021,RD8
RD8,C155,9,5,Trastuzumab Cisplatin Capecitabine=,2,ONDANSETRON,8,1,25/10/2021,Oct,2021,RD8
RD8,C155,9,5,Trastuzumab Cisplatin Capecitabine=,2,DEXAMETHASONE,12,1,25/10/2021,Oct,2021,RD8
RD8,C155,9,5,Trastuzumab Cisplatin Capecitabine=,2,MAGNESIUM SULPHATE,8,98,25/10/2021,Oct,2021,RD8
RD8,C155,9,5,Trastuzumab Cisplatin Capecitabine=,2,FUROSEMIDE,40,1,25/10/2021,Oct,2021,RD8
RD8,C155,9,5,Trastuzumab Cisplatin Capecitabine=,2,DEXAMETHASONE,6,1,25/10/2021,Oct,2021,RD8
RD8,C155,9,5,Trastuzumab Cisplatin Capecitabine=,2,METOCLOPRAMIDE,10,1,25/10/2021,Oct,2021,RD8
RD8,C155,9,5,Trastuzumab Cisplatin Capecitabine=,2,CAPECITABINE,1500,1,25/10/2021,Oct,2021,RD8
RD8,C155,9,5,Trastuzumab Cisplatin Capecitabine=,2,TRASTUZUMAB,504,1,26/10/2021,Oct,2021,RD8
RD8,C349,,2,Pembrolizumab Pemetrexed Carboplatin without pemetrexed maintenance (CrCl)=,2,PEMBROLIZUMAB,200,1,12/10/2021,Oct,2021,RD8
RD8,C349,,2,Pembrolizumab Pemetrexed Carboplatin without pemetrexed maintenance (CrCl)=,2,PEMETREXED,800,1,12/10/2021,Oct,2021,RD8
RD8,C349,,2,Pembrolizumab Pemetrexed Carboplatin without pemetrexed maintenance (CrCl)=,2,CARBOPLATIN,630,1,12/10/2021,Oct,2021,RD8
RD8,C349,,2,Pembrolizumab Pemetrexed Carboplatin without pemetrexed maintenance (CrCl)=,2,FOLIC ACID,400,2,12/10/2021,Oct,2021,RD8
RD8,C349,,2,High emetic risk ondansetron 1.5 days=,2,ONDANSETRON,8,1,12/10/2021,Oct,2021,RD8
RD8,C349,,2,High emetic risk ondansetron 1.5 days=,2,DEXAMETHASONE,8,1,12/10/2021,Oct,2021,RD8
RD8,C184,9,3,Calcium folinate 350mg=,2,CALCIUM FOLINATE,350,1,06/10/2021,Oct,2021,RD8
RD8,C184,9,3,Calcium folinate 350mg=,2,CALCIUM FOLINATE,350,1,20/10/2021,Oct,2021,RD8
RD8,C184,9,3,Cetuximab Oxaliplatin Modified DeGramont=,2,CETUXIMAB,800,1,06/10/2021,Oct,2021,RD8
RD8,C184,9,3,Cetuximab Oxaliplatin Modified DeGramont=,2,FLUOROURACIL,3150,1,06/10/2021,Oct,2021,RD8
RD8,C184,9,3,Cetuximab Oxaliplatin Modified DeGramont=,2,SODIUM CHLORIDE,500,98,20/10/2021,Oct,2021,RD8
RD8,C184,9,3,Cetuximab Oxaliplatin Modified DeGramont=,2,CETUXIMAB,800,1,20/10/2021,Oct,2021,RD8
RD8,C184,9,3,Cetuximab Oxaliplatin Modified DeGramont=,2,FLUOROURACIL,3150,1,20/10/2021,Oct,2021,RD8
RD8,C184,9,3,Moderate emetic risk ondansetron 1.5 days=,2,ONDANSETRON,8,1,06/10/2021,Oct,2021,RD8
RD8,C184,9,3,Moderate emetic risk ondansetron 1.5 days=,2,ONDANSETRON,8,1,20/10/2021,Oct,2021,RD8
RD8,C61X,9,2,Docetaxel (75) (prostate)=,2,Sodium Chloride,500,98,25/10/2021,Oct,2021,RD8
RD8,C61X,9,2,Docetaxel (75) (prostate)=,2,DOCETAXEL,148,1,25/10/2021,Oct,2021,RD8
RD8,C61X,9,2,Docetaxel (75) (prostate)=,2,PREDNISOLONE,5,1,25/10/2021,Oct,2021,RD8
RD8,C220,9,2,Atezolizumab Bevacizumab=,2,ATEZOLIZUMAB,1200,1,21/10/2021,Oct,2021,RD8
RD8,C220,9,2,Atezolizumab Bevacizumab=,2,BEVACIZUMAB,1100,1,21/10/2021,Oct,2021,RD8
RD8,C900,,,Zoledronic acid 4 weekly (support)=,2,ZOLEDRONIC ACID,4,1,19/10/2021,Oct,2021,RD8
RD8,C900,,,Zoledronic acid 4 weekly (support)=,2,CALCICHEW-D3 FORTE,2,99,19/10/2021,Oct,2021,RD8
RD8,C911,,,Metoclopramide 28 day=,2,METOCLOPRAMIDE,10,1,28/10/2021,Oct,2021,RD8
RD8,C911,3,2,Venetoclax Rituximab=,2,Venetoclax,400,1,28/10/2021,Oct,2021,RD8
RD8,C911,3,2,Venetoclax Rituximab=,2,ACICLOVIR,200,1,28/10/2021,Oct,2021,RD8
RD8,C509,,,Aprepitant without dexamethasone (day 1 on ward)=,2,APREPITANT,125,1,13/10/2021,Oct,2021,RD8
RD8,C509,2,1,Docetaxel Carboplatin Phesgo SC (neoadjuvant node negative / unknown) CrCl=,2,SODIUM CHLORIDE,500,98,13/10/2021,Oct,2021,RD8
RD8,C509,2,1,Docetaxel Carboplatin Phesgo SC (neoadjuvant node negative / unknown) CrCl=,2,ONDANSETRON,8,1,13/10/2021,Oct,2021,RD8
RD8,C509,2,1,Docetaxel Carboplatin Phesgo SC (neoadjuvant node negative / unknown) CrCl=,2,Pertuzumab / Trastuzumab,1200,1,13/10/2021,Oct,2021,RD8
RD8,C509,2,1,Docetaxel Carboplatin Phesgo SC (neoadjuvant node negative / unknown) CrCl=,2,DOCETAXEL,108,1,13/10/2021,Oct,2021,RD8
RD8,C509,2,1,Docetaxel Carboplatin Phesgo SC (neoadjuvant node negative / unknown) CrCl=,2,CARBOPLATIN,700,1,13/10/2021,Oct,2021,RD8
RD8,C509,2,1,GCSF filgrastim 5 days=,2,FILGRASTIM,30,98,13/10/2021,Oct,2021,RD8
RD8,C509,,,Magnesium glycerophosphate=,2,MAGNESIUM GLYCEROPHOSPHATE,4,98,13/10/2021,Oct,2021,RD8
RD8,C833,,,Intrathecal Methotrexate=,2,METHOTREXATE,12.5,1,28/10/2021,Oct,2021,RD8
RD8,C833,9,1,Ondansetron metoclopramide 5 days=,2,ONDANSETRON,8,1,27/10/2021,Oct,2021,RD8
RD8,C833,9,1,R-CHOP-21 bolus =,2,SODIUM CHLORIDE,500,98,06/10/2021,Oct,2021,RD8
RD8,C833,9,1,R-CHOP-21 bolus =,2,PARACETAMOL,1000,1,06/10/2021,Oct,2021,RD8
RD8,C833,9,1,R-CHOP-21 bolus =,2,CHLORPHENAMINE,10,1,06/10/2021,Oct,2021,RD8
RD8,C833,9,1,R-CHOP-21 bolus =,2,RITUXIMAB,600,1,06/10/2021,Oct,2021,RD8
RD8,C833,9,1,R-CHOP-21 bolus =,2,DOXORUBICIN,55,1,06/10/2021,Oct,2021,RD8
RD8,C833,9,1,R-CHOP-21 bolus =,2,VINCRISTINE SULPHATE,0.75,1,06/10/2021,Oct,2021,RD8
RD8,C833,9,1,R-CHOP-21 bolus =,2,CYCLOPHOSPHAMIDE,800,1,06/10/2021,Oct,2021,RD8
RD8,C833,9,1,R-CHOP-21 bolus =,2,PREDNISOLONE,60,1,27/10/2021,Oct,2021,RD8
RD8,C833,9,1,R-CHOP-21 bolus =,2,PARACETAMOL,1000,1,27/10/2021,Oct,2021,RD8
RD8,C833,9,1,R-CHOP-21 bolus =,2,CHLORPHENAMINE,10,1,27/10/2021,Oct,2021,RD8
RD8,C833,9,1,R-CHOP-21 bolus =,2,RITUXIMAB,600,1,27/10/2021,Oct,2021,RD8
RD8,C833,9,1,R-CHOP-21 bolus =,2,DOXORUBICIN,36,1,27/10/2021,Oct,2021,RD8
RD8,C833,9,1,R-CHOP-21 bolus =,2,VINCRISTINE SULPHATE,0.75,1,27/10/2021,Oct,2021,RD8
RD8,C833,9,1,R-CHOP-21 bolus =,2,CYCLOPHOSPHAMIDE,600,1,27/10/2021,Oct,2021,RD8
RD8,C900,3,2,Apixaban=,2,APIXABAN,5,1,11/10/2021,Oct,2021,RD8
RD8,C900,3,2,Lansoprazole=,2,LANSOPRAZOLE,30,1,11/10/2021,Oct,2021,RD8
RD8,C900,3,2,Lenalidomide Dexamethasone=,2,LENALIDOMIDE,10,1,11/10/2021,Oct,2021,RD8
RD8,C900,3,2,Lenalidomide Dexamethasone=,2,DEXAMETHASONE,20,1,11/10/2021,Oct,2021,RD8
RD8,C900,3,2,Lenalidomide Dexamethasone=,2,FLUCONAZOLE,50,1,11/10/2021,Oct,2021,RD8
RD8,C900,3,2,Lenalidomide Dexamethasone=,2,ACICLOVIR,200,1,11/10/2021,Oct,2021,RD8
RD8,C900,3,2,Lenalidomide Dexamethasone=,2,CO-TRIMOXAZOLE,960,1,11/10/2021,Oct,2021,RD8
RD8,C900,3,2,Zoledronic acid 4 weekly (support)=,2,ZOLEDRONIC ACID,3,1,11/10/2021,Oct,2021,RD8
RD8,C900,3,2,Zoledronic acid 4 weekly (support)=,2,CALCIUM CARBONATE WITH COLECALCIFER,2,99,11/10/2021,Oct,2021,RD8